Article delegate-en/496 of [1-5169] on the server localhost:119
  upper oldest olders older1 this newer1 newers latest
search
[Top/Up] [oldest] - [Older+chunk] - [Newer+chunk] - [newest + Check]

Newsgroups: mail-lists.delegate-en

[DeleGate-En] Compile problems
11 Jun 1999 16:04:27 GMT Jurijs Turjanskis <p6aaqbdyi-e6yeroh7kxtr.ml@ml.delegate.org>


   
  When I compile Delegate 5.9.2 on RedHat 6.0

#make PATH=".:$PATH" CC=gcc     (without that parametrs he don't compile)

I receive following error:

..............................

make[4]: Entering directory `/usr/src/delegate5.9.2/teleport'
gcc -O&nbsp; -I../include&nbsp; -c teleport.c
gcc -O&nbsp; -I../include&nbsp; -c teleportd.c
teleportd.c:24: macro `strdup' used without args
make[4]: *** [teleportd.o] Error 1
make[4]: Leaving directory `/usr/src/delegate5.9.2/teleport'
make[3]: *** [libx] Error 2
make[3]: Leaving directory `/usr/src/delegate5.9.2/teleport'
mkmake: ERROR LOG is left at /usr/src/delegate5.9.2/teleport/mkmake.err
mkmake: ERROR LOG is left at /usr/src/delegate5.9.2/teleport/mkmake.err
make[2]: *** [../lib/libteleport.a] Error 2
make[2]: Leaving directory `/usr/src/delegate5.9.2/src'
make[1]: *** [start0] Error 2
make[1]: Leaving directory `/usr/src/delegate5.9.2/src'
mkmake: ERROR LOG is left at /usr/src/delegate5.9.2/src/mkmake.err
mkmake: ERROR LOG is left at /usr/src/delegate5.9.2/src/mkmake.err
make: *** [all] Error 2

..............................

Where is the problem?


  admin search upper oldest olders older1 this newer1 newers latest
[Top/Up] [oldest] - [Older+chunk] - [Newer+chunk] - [newest + Check]
@_@V