Article delegate-en/4370 of [1-5169] on the server localhost:119
  upper oldest olders older1 this newer1 newers latest
search
[Top/Up] [oldest] - [Older+chunk] - [Newer+chunk] - [newest + Check]

Newsgroups: mail-lists.delegate-en

[DeleGate-En] I got error when i tried to make delegate
20 Feb 2009 07:06:58 GMT Arun v vempan <p4eiabdyi-kvvvzvhf4r3r.ml@ml.delegate.org>


Dear Yutako,

I used differnt verison of delegate and os like
redhat,centos,susue,Still I am getting the same error.The error is
given below .pls check and clear me.



usr/bin/make -f Makefile.go libteleport.a SHELL="/bin/sh" HDRDIR="-I../include "
make[4]: Entering directory `/usr/local/src/delegate7.9.3/teleport'
cc -O  -I../include  -c teleportd.c
teleportd.c:801: error: static declaration of 'udpAgent' follows
non-static declaration
teleportd.c:616: error: previous declaration of 'udpAgent' was here
make[4]: *** [teleportd.o] Error 1
make[4]: Leaving directory `/usr/local/src/delegate7.9.3/teleport'
make[3]: *** [libx] Error 2
make[3]: Leaving directory `/usr/local/src/delegate7.9.3/teleport'
mkmake: ERROR LOG is left at /usr/local/src/delegate7.9.3/teleport/mkmake.err
mkmake: ERROR LOG is left at /usr/local/src/delegate7.9.3/teleport/mkmake.err
make[2]: *** [../lib/libteleport.a] Error 2
make[2]: Leaving directory `/usr/local/src/delegate7.9.3/src'
make[1]: *** [start0] Error 2
make[1]: Leaving directory `/usr/local/src/delegate7.9.3/src'
mkmake: ERROR LOG is left at /usr/local/src/delegate7.9.3/src/mkmake.err
mkmake: ERROR LOG is left at /usr/local/src/delegate7.9.3/src/mkmake.err
make: *** [all] Error 2




Regards Arun.v

  admin search upper oldest olders older1 this newer1 newers latest
[Top/Up] [oldest] - [Older+chunk] - [Newer+chunk] - [newest + Check]
@_@V